{"text_format":"1","workbook":"xlsx","n_sheets":6,"sheets":["Konfigurátor rozvodnice","Souhrnná tabulka rozhraní","Typový štítek","Výpočet oteplení","Rozvaděče1 (2)","Ceník Hager_Polo_Tehalit"],"not_rendered":{"charts":0,"images":4,"macros":0,"external_links":0,"defined_names":153,"comments":0,"pivot_tables":0},"unopened":[],"bounds":{"document_bytes":16777216,"sheet_cells":100000,"rows_first":2000,"rows_last":500,"rows_between":2000,"halvings":0,"cell_chars":16384,"cell_head_chars":4096},"cells_cut":0,"cells_raw":0,"read":"whole","date_system":"1900"}

{"sheet":"Konfigurátor rozvodnice","index":0,"n_rows":76,"n_cols":101,"rows_kept":76,"cut":false,"hidden":false,"merged":[[12,4,12,10],[10,4,10,10],[40,2,40,10],[47,2,47,3],[7,4,7,5],[5,4,5,5],[7,6,7,10],[5,6,5,10],[4,2,4,3],[5,2,5,3],[53,2,53,4],[50,8,50,10],[13,2,13,4],[13,5,13,7],[13,8,13,10],[48,2,48,3],[49,2,49,3],[42,2,42,3],[43,2,43,3],[44,2,44,3],[45,2,45,3],[46,2,46,3],[51,2,51,10],[50,2,50,7]]}
[null,null,"Vyplňuje se pouze zelená část","verze 2023_09",null,null,null,null,null,null,null,null,null,null,null,null,"Produkt",null,"provedení","provedení 2","proud",null,null,null,"Jistič6kAcharB","Jistič6kAcharC","Jistič6kAbezšroubovýQCcharB","Jistič6kAbezšroubovýQCcharC","Jistič10kAcharB","Jistič10kAcharC","Jistič10kAcharD","Jistič15kAcharB","Jistič15kAcharC","Jistič15kAcharD","Příslušenstvíjističe","Motorovýspouštěč3Pól","Proudovýchránič003A6kA","Proudovýchránič001A6kA","Proudovýchránič01A6kA","Proudovýchránič03A6kA","Proudovýchránič05A6kA","Proudovýchránič003A10kA","Proudovýchránič001A10kA","Proudovýchránič01A10kA","Proudovýchránič03A10kA","Proudovýchránič05A10kA","Kombichránič2p6kA","Kombichránič2p6kAGzpožděné","Kombichránič2p10kA","Kombichránič2p10kAGzpožděné","Kombichránič4p6kA","Kombichránič4p10kA","Kombichránič3x1p6kA","AFDDjistič6kA","AFDDRCBO6kA","AFDDjistič10kA","AFDDRCBO10kA","Vypínač","Vypínačskontrolkou","PřepínačI0II","PřepínačIII","Otočnývypínač","OtočnýpřepínačI0II","Instalačnírelé16A","Stykačsesnížhlučností16A","Stykačsesnížhlučností25A","Stykačsesnížhlučností40A","Stykačsesnížhlučností63A","Instalačnírelé16Asesnižhluč","Stykačsautnávratem25A","Stykačsautnávratem40A","Stykačsautnávratem63A","Stykačsautnávratemsesnížhlučností25A","Stykač25A","Stykač40A","Stykač63A","KombinovanýsvodičpřepětíTyp1aTyp2","SvodičpřepětíTyp2","SvodičpřepětíTyp3","Kontrolka12V","Kontrolka230V","Tlačítka","Stiskacíspínač","Analogovéspínacíhodiny","Digitálníspínacíhodiny","zvonkyabzučáky","transformátor","Časovérelé","Schodišťovýautomat","Impulsnírelé","Elektronickéimpulsnírelé","Stmívač","Soumrakovéčidlo","Elektroměry1fázové","Elektroměry3fázové","Pojistkovéodpojovače10x38","Pojistkovéodpojovače14x51","Pojistkovéodpojovače22x58","Válcovápojistka10x38","Válcovápojistka14x51","Válcovápojistka22x58"]
[null,null,"Upozornění rozvaděče Vector II pro DC napětí je potřeba řešit jako rozvaděč PSC dle ČSN EN 61439-2",null,null,null,null,null,null,null,null,null,null,null,null,null,"Jistič 6kA, char. B","Jistič6kAcharB","1-pól.","3-pól.",0.5,{"$f":"LEN(Q2)","v":19},null,null,{"$f":"CONCATENATE(\"pro1\",Y1)","v":"pro1Jistič6kAcharB"},{"$f":"CONCATENATE(\"pro1\",Z1)","v":"pro1Jistič6kAcharC"},"pro1Jistič6kAbezšroubovýQCcharB","pro1Jistič6kAbezšroubovýQCcharC","pro1Jistič10kAcharB","pro1Jistič10kAcharC","pro1Jistič10kAcharD","pro1Jistič15kAcharB","pro1Jistič15kAcharC","pro1Jistič15kAcharD","pro1Příslušenstvíjističe","pro1Motorovýspouštěč3Pól","pro1Proudovýchránič003A6kA","pro1Proudovýchránič001A6kA","pro1Proudovýchránič01A6kA","pro1Proudovýchránič03A6kA","pro1Proudovýchránič05A6kA","pro1Proudovýchránič003A10kA","pro1Proudovýchránič001A10kA","pro1Proudovýchránič01A10kA","pro1Proudovýchránič03A10kA","pro1Proudovýchránič05A10kA","pro1Kombichránič2p6kA","pro1Kombichránič2p6kAGzpožděné","pro1Kombichránič2p10kA","pro1Kombichránič2p10kAGzpožděné",{"$f":"CONCATENATE(\"pro1\",AY1)","v":"pro1Kombichránič4p6kA"},"pro1Kombichránič4p10kA",{"$f":"CONCATENATE(\"pro1\",BA1)","v":"pro1Kombichránič3x1p6kA"},"pro1AFDDjistič6kA","pro1AFDDRCBO6kA","pro1AFDDjistič10kA","pro1AFDDRCBO10kA","pro1Vypínač","pro1Vypínačskontrolkou","pro1PřepínačI0II","pro1PřepínačIII","pro1Otočnývypínač","pro1OtočnýpřepínačI0II","pro1Instalačnírelé16A",{"$f":"CONCATENATE(\"pro1\",BM1)","v":"pro1Stykačsesnížhlučností16A"},{"$f":"CONCATENATE(\"pro1\",BN1)","v":"pro1Stykačsesnížhlučností25A"},"pro1Stykačsesnížhlučností40A","pro1Stykačsesnížhlučností63A","pro1Instalačnírelé16Asesnižhluč","pro1Stykačsautnávratem25A","pro1Stykačsautnávratem40A","pro1Stykačsautnávratem63A","pro1Stykačsautnávratemsesnížhlučností25A","pro1Stykač25A","pro1Stykač40A","pro1Stykač63A","pro1KombinovanýsvodičpřepětíTyp1aTyp2","pro1SvodičpřepětíTyp2","pro1SvodičpřepětíTyp3","pro1Kontrolka12V","pro1Kontrolka230V","pro1Tlačítka","pro1Stiskacíspínač","pro1Analogovéspínacíhodiny","pro1Digitálníspínacíhodiny","pro1zvonkyabzučáky","pro1transformátor","pro1Časovérelé","pro1Schodišťovýautomat","pro1Impulsnírelé","pro1Elektronickéimpulsnírelé","pro1Stmívač","pro1Soumrakovéčidlo","pro1Elektroměry1fázové",{"$f":"CONCATENATE(\"pro1\",CQ1)","v":"pro1Elektroměry3fázové"},"pro1Pojistkovéodpojovače10x38","pro1Pojistkovéodpojovače14x51","pro1Pojistkovéodpojovače22x58","pro1Válcovápojistka10x38","pro1Válcovápojistka14x51","pro1Válcovápojistka22x58"]
[null,null,"Rozvaděče pro PV systémy musí být kalkulovány se součinitelem soudobosti RDF=1",null,null,null,null,null,null,null,null,null,null,null,null,null,"Jistič 6kA, char. C","Jistič6kAcharC","1+N","4-pól.",1,{"$f":"LEN(Q3)","v":19},null,null,"1-pól.","1-pól.","1-pól.","1-pól.","1-pól.","1-pól.","1-pól.","1-pól.","1-pól.","1-pól.","Pomocný kontakt","0,1-0,16 A","2-Pól. Typ A","2-Pól. Typ A","2-Pól. Typ A","2-Pól. Typ A","2-Pól. Typ A","2-Pól. Typ A","2-Pól. Typ A","2-Pól. Typ A","2-Pól. Typ A","2-Pól. Typ A","char. B","char. B, bezšroubové QC","char. B","char. B","char. B","char. B","char. B","char. B, bezšroubové QC","char. B, bezšroubové QC","char. B","char. B","1-pól.","na výstupu 1-pól.","1-pól. - výstupní kontakt spodem","1-pól. - výstupní kontakt horem","3-pól. (20-63A)","3-pól. (20-80A)","2S","2S+2R","1S","2S","2S","2S+2R","2S","3S","3S","2S","1S","2S","2S","25kA/pól.","1-pól.","2-pól.","Zelená","Zelená","1S, 16A, 230V","1S, 16A, 230V","denní bez rezervy chodu, 1S","1-kanálové týdenní 2 mod.","zvonek 8-12V","8-12V; 0,5A","zpožděné sepnutí","standardní","1S, 230VAC","1S, 230VAC","pro žárovky, LED, CFL 500W","s nástěnným čidlem","40 A","40 A","1-Pól.","1-Pól.","1-Pól.","char. gG","char. gG","char. gG"]
[null,null,null,null,null,null,null,null,null,null,null,null,null,null,null,null,"Jistič 6kA bezšroubový QC, char. B","Jistič6kAbezšroubovýQCcharB","12,5kA/pól.","3+1-pól.",2,{"$f":"LEN(Q6)","v":20},null,null,"1+N","1+N","1+N","1+N","1+N","1+N","1+N","2-pól.","2-pól.","2-pól.","Signální kontakt","0,16-0,25 A","4-Pól. Typ A",null,"4-Pól. Typ A","4-Pól. Typ A","4-Pól. Typ A","4-Pól. Typ A",null,"4-Pól. Typ A","4-Pól. Typ A","4-Pól. Typ A","char. C","char. C, bezšroubové QC","char. C","char. C","char. C","char. C","char. C","char. C, bezšroubové QC","char. C, bezšroubové QC","char. C","char. C","2-pól.","na výstupu 2-pól.","2-pól. - výstupní kontakt spodem","2-pól. - výstupní kontakt horem","4-pól. (20-63A)","4-pól. (20-80A)","2R",null,"2S","3S","3S",null,"2R","4S","4S","3S","1R","2R","2R","12,5kA/pól. varistorový","2-pól.","3+1-pól.","červená","červená","1R, 16A, 230V","1R, 16A, 230V","denní s rezervou chodu 1S","1-kanálové roční Bluetooth","zvonek 230V","8-12V; 1A","zpožděné rozepnutí","multifunkční","1S, 24VAC/12DC","1S, 230VAC, bešroubový","pro žárovky, LED, CFL 500W komfort","s vestavným čidlem","80 A","80 A","2-Pól.","3-Pól.","3-Pól.","char. aM","char. aM","char. aM"]
[null,null,"Vyberte rozvaděč",null,"Rozměr rozvaděče",null,"Třídá izolace rozvaděče",null,null,null,null,null,null,null,null,null,"Jistič 6kA bezšroubový QC, char. C","Jistič6kAbezšroubovýQCcharC","1R","2-pól.",3,20,null,null,"1+N (1MOD)","1+N (1MOD)","3-pól.","3-pól.","2-pól.","2-pól.","2-pól.","3-pól.","3-pól.","3-pól.","Pracovní spoušť (napěťová) 230-415V AC","0,25-0,4 A","2-pól. bezšroubové QC",null,"4-Pól. Typ A/G - zpožděný","4-Pól. Typ A/S - selektivní",null,"2-Pól. Typ A/G - zpožděný",null,"2-Pól. Typ A/G - zpožděný","4-Pól. Typ A/S - selektivní",null,"char. B, bezšroubové QC",null,null,null,null,null,null,null,null,null,null,"3-pól.","mezi vstupy 2-pól.","1-pól. - výstupní kontakt horem","1-pól. - výstupní kontakt spodem","3-pól. (63-100A)","4-pól. (63-125A)","1S+1R",null,"3S","4S","4S",null,"1S+1R","Příslušenství","Příslušenství","4S","2S","3S","3S",null,"3-pól.",null,null,"žlutá","2S, 16A, 230V","2S, 16A, 230V","denní bez rezervy chodu, 1P","2-kanálové roční Bluetooth","bzučák 8-12V","8-12V; 2A","s volitelnou délkou od sepnutí",null,"1S, 24VDC","1S, 230VAC, s automatickým vypnutím","pro žárovky, LED, CFL 300W",null,null,"125 A","3-Pól.","3P+N","3P+N","char. gPV (DC)"]
[null,null,null,null,{"$f":"IFERROR('Výpočet oteplení'!H38,\" \")","v":" "},null,{"$f":"IFERROR('Výpočet oteplení'!L38,\" \")","v":" "},null,null,null,null,null,null,null,null,null,"Jistič 10kA, char. B","Jistič10kAcharB","1S","230V AC",4,20,null,null,"2-pól.","2-pól.","3+N","3+N","3-pól.","3-pól.","3-pól.","4-pól.","4-pól.","4-pól.","Podpěťová spoušť 230V AC","0,4-0,63 A","4-pól. bezšroubové QC",null,"4-Pól. Typ A/S - selektivní",null,null,"4-Pól. Typ A/G - zpožděný",null,"4-Pól. Typ A/G - zpožděný","4-Pól. Typ A/S/HI - selektivní a vysoká imunita",null,"char. C, bezšroubové QC",null,null,null,null,null,null,null,null,null,null,"4-pól.","na vstupu 1-pól.","2-pól. - výstupní kontakt horem","2-pól. - výstupní kontakt spodem","4-pól. (63-100A)",null,"3S",null,"4S",null,null,null,"3S",null,null,null,"2R","4S","4S",null,"3+1-pól.",null,null,"modrá","2R, 16A, 230V","2R, 16A, 230V","denní s rezervou chodu 1P","4-kanálové roční Bluetooth","bzučák 230V","12V; 1,67A","impulsní konvertor",null,"1S, 12VAC",null,"pro žárovky, LED, CFL 300W komfort",null,null,"x/5 A (nepřímé)","3P+N","2-Pól.","2-Pól."]
[null,null,"Vyberte typ dveří","Vyberte typ PE/N svorek","Krytí rozvaděče",null,"Počet modulů",null,null,null,null,null,null,null,null,null,"Jistič 10kA, char. C","Jistič10kAcharC","1S+1R","24V AC",6,20,null,null,"3-pól.","3-pól.",null,null,"3+N","3+N","3+N",null,null,null,"Podpěťová spoušť 48V DC ","0,6-1,0 A","4-Pól. Typ A/G - zpožděný",null,null,null,null,"4-Pól. Typ A/HI - vysoká imunita",null,"4-Pól. Typ A/HI - vysoká imunita","2-Pól. Typ B",null,null,null,null,null,null,null,null,null,null,null,null,"4-pól. QC - bezšroubový","na vstupu 2-pól.","3-pól.","1S+1R","3-pól. (100-125A)",null,"4S",null,"4R",null,null,null,"4S",null,null,null,"1S+1R","4R","4R",null,null,null,null,"čirá","1S+1R, 16A, 230V","1S+1R, 16A, 230V","týdenní s rezervou chodu 1P",null,null,"24V; 0,834A","blikací relé",null,"2S, 230VAC",null,"Pro žárovky, se vstupem 1-10V 1000W",null,null,null,"1P+N"]
[null,null,null,null,{"$f":"IFERROR('Výpočet oteplení'!K38,\" \")","v":" "},null,{"$f":"IFERROR('Výpočet oteplení'!J38,\" \")","v":" "},null,null,null,null,null,null,null,null,null,"Jistič 10kA, char. D","Jistič10kAcharD","25kA/pól.","12V AC",10,20,null,null,"3+N","3+N",null,null,"4-pól.","4-pól.","4-pól.",null,null,null,"Pracovní spoušť (napěťová) 24-48V AC 12-48V DC","1,0-1,6 A","4-Pól. Typ A/HI - vysoká imunita",null,null,null,null,"2-Pól. Typ F",null,"2-Pól. Typ A/S - selektivní","4-Pól. Typ B",null,null,null,null,null,null,null,null,null,null,null,null,"Příslušenství","na vstupu 2-pól.","4-pól.",null,"4-pól. (100-125A)",null,"2S+2R",null,"2S+2R",null,null,null,"Příslušenství",null,null,null,"3S","2S+2R","2S+2R",null,null,null,null,"zelena+červená","2S, 16A, 230V s kontrolkou Č+Z","1S, 16A, 230V s kontrolkou",null,null,null,"12-24V; 2,08A","multifunkční",null,"2S, 24VAC",null,"Pro žárovky, se vstupem 1-10V 1000W komfort",null,null,null,"1-Pól.+signal."]
{"$rows_left_out":69}
{"sheet":"Souhrnná tabulka rozhraní","index":1,"n_rows":37,"n_cols":11,"rows_kept":37,"cut":false,"hidden":false,"merged":[]}
[null,"Typ rozvodnice:",{"$f":"'Konfigurátor rozvodnice'!D11","v":" "}]
[null,"Výrobce:","Elektro František Novák"]
[null,null,"Novácká 111"]
[null,null,"Nová Paka"]
[null,null,"507 91"]
[]
[]
[null,"Souhrnná tabulka údajů pro charakteristiku rozhraní a základních parametrů rozvodnice dle ČSN 61439-3:"]
{"$rows_left_out":30}
{"sheet":"Typový štítek","index":2,"n_rows":28,"n_cols":7,"rows_kept":28,"cut":false,"hidden":false,"merged":[[1,3,7,6],[20,4,20,6],[21,3,21,4],[21,5,21,6],[24,3,24,4],[24,5,24,6],[22,3,22,4],[22,5,22,6],[23,3,23,4],[23,5,23,6]]}
[]
[null,null,null,"Vyplňte, pomocí lihové fixi, žlutě vyznačené údaje do HAGER typového štítku nebo štítek vytiskněte na adekvátní podklad. To znamená, že tisk na štítku musí být odolný vůči otěru vodou a benzínem."]
[]
[]
[]
[]
[]
[]
{"$rows_left_out":21}
{"sheet":"Výpočet oteplení","index":3,"n_rows":39,"n_cols":18,"rows_kept":39,"cut":false,"hidden":true,"merged":[]}
[]
["Rozvaděč","popis","množství",null,"ztrátový výkon W","kapacita modulů"]
[{"$f":"'Konfigurátor rozvodnice'!C11","v":" "},null,1,null,{"$f":"VLOOKUP(A3,'Rozvaděče1 (2)'!D:F,3,0)","v":{"$error":"#N/A"}},{"$f":"VLOOKUP(A3,'Rozvaděče1 (2)'!D:M,10,0)","v":{"$error":"#N/A"}},{"$f":"'Konfigurátor rozvodnice'!C11","v":" "},{"$f":"IF(O3>0,M3,\" \")","v":" "},null,null,{"$f":"CONCATENATE(G3,\"-\",SUM(C5:C30),\"-\",H32,\"-\",I32,\"-\",J32,H3)","v":" -0-0-0-0 "},null,{"$f":"CONCATENATE(\"-\",N3,\"-\",O3)","v":"-SE-0"},{"$f":"IF('Konfigurátor rozvodnice'!I51>0,\"SE\",\" \")","v":"SE"},{"$f":"SUM('Konfigurátor rozvodnice'!G44:G50)","v":0}]
["Přístroje","popis","množství",null,"ztrátový výkon při jmen proudu","počet modulů","vývodů","chrániče","1f","výcepól"]
[{"$f":"'Konfigurátor rozvodnice'!I16","v":""},{"$f":"'Konfigurátor rozvodnice'!J16","v":""},{"$f":"'Konfigurátor rozvodnice'!F16","v":0},{"$f":"'Konfigurátor rozvodnice'!K16","v":""},{"$f":"IFERROR(VLOOKUP(A5,'Ceník Hager_Polo_Tehalit'!B:L,11,0),\"\")","v":""},{"$f":"IFERROR(VLOOKUP(A5,'Ceník Hager_Polo_Tehalit'!B:L,10,0),\"\")","v":""},{"$f":"IFERROR(VLOOKUP(A5,'Ceník Hager_Polo_Tehalit'!B:M,12,0),\"\")","v":""},{"$f":"IFERROR(VLOOKUP(A5,'Ceník Hager_Polo_Tehalit'!B:N,13,0),\"\")","v":""},{"$f":"IFERROR(VLOOKUP(A5,'Ceník Hager_Polo_Tehalit'!B:O,14,0),\"\")","v":""},{"$f":"IFERROR(VLOOKUP(A5,'Ceník Hager_Polo_Tehalit'!B:P,15,0),\"\")","v":""}]
[{"$f":"'Konfigurátor rozvodnice'!I17","v":""},{"$f":"'Konfigurátor rozvodnice'!J17","v":""},{"$f":"'Konfigurátor rozvodnice'!F17","v":0},{"$f":"'Konfigurátor rozvodnice'!K17","v":""},{"$f":"IFERROR(VLOOKUP(A6,'Ceník Hager_Polo_Tehalit'!B:L,11,0),\"\")","v":""},{"$f":"IFERROR(VLOOKUP(A6,'Ceník Hager_Polo_Tehalit'!B:L,10,0),\"\")","v":""},{"$f":"IFERROR(VLOOKUP(A6,'Ceník Hager_Polo_Tehalit'!B:M,12,0),\"\")","v":""},{"$f":"IFERROR(VLOOKUP(A6,'Ceník Hager_Polo_Tehalit'!B:N,13,0),\"\")","v":""},{"$f":"IFERROR(VLOOKUP(A6,'Ceník Hager_Polo_Tehalit'!B:O,14,0),\"\")","v":""},{"$f":"IFERROR(VLOOKUP(A6,'Ceník Hager_Polo_Tehalit'!B:P,15,0),\"\")","v":""}]
[{"$f":"'Konfigurátor rozvodnice'!I18","v":""},{"$f":"'Konfigurátor rozvodnice'!J18","v":""},{"$f":"'Konfigurátor rozvodnice'!F18","v":0},{"$f":"'Konfigurátor rozvodnice'!K18","v":""},{"$f":"IFERROR(VLOOKUP(A7,'Ceník Hager_Polo_Tehalit'!B:L,11,0),\"\")","v":""},{"$f":"IFERROR(VLOOKUP(A7,'Ceník Hager_Polo_Tehalit'!B:L,10,0),\"\")","v":""},{"$f":"IFERROR(VLOOKUP(A7,'Ceník Hager_Polo_Tehalit'!B:M,12,0),\"\")","v":""},{"$f":"IFERROR(VLOOKUP(A7,'Ceník Hager_Polo_Tehalit'!B:N,13,0),\"\")","v":""},{"$f":"IFERROR(VLOOKUP(A7,'Ceník Hager_Polo_Tehalit'!B:O,14,0),\"\")","v":""},{"$f":"IFERROR(VLOOKUP(A7,'Ceník Hager_Polo_Tehalit'!B:P,15,0),\"\")","v":""}]
[{"$f":"'Konfigurátor rozvodnice'!I19","v":""},{"$f":"'Konfigurátor rozvodnice'!J19","v":""},{"$f":"'Konfigurátor rozvodnice'!F19","v":0},{"$f":"'Konfigurátor rozvodnice'!K19","v":""},{"$f":"IFERROR(VLOOKUP(A8,'Ceník Hager_Polo_Tehalit'!B:L,11,0),\"\")","v":""},{"$f":"IFERROR(VLOOKUP(A8,'Ceník Hager_Polo_Tehalit'!B:L,10,0),\"\")","v":""},{"$f":"IFERROR(VLOOKUP(A8,'Ceník Hager_Polo_Tehalit'!B:M,12,0),\"\")","v":""},{"$f":"IFERROR(VLOOKUP(A8,'Ceník Hager_Polo_Tehalit'!B:N,13,0),\"\")","v":""},{"$f":"IFERROR(VLOOKUP(A8,'Ceník Hager_Polo_Tehalit'!B:O,14,0),\"\")","v":""},{"$f":"IFERROR(VLOOKUP(A8,'Ceník Hager_Polo_Tehalit'!B:P,15,0),\"\")","v":""}]
{"$rows_left_out":32}
{"sheet":"Rozvaděče1 (2)","index":4,"n_rows":392,"n_cols":39,"rows_kept":392,"cut":false,"hidden":true,"merged":[]}
[null,null,"Objednací číslo",null,"Popis","Ztrátové výkony [W]",null,"Počet pólů","Jmenovity proud In","charakterisika","typ montáže","rozměry VxŠxH","počet modulů / kapacita","krytí IP","tř. izolace",null,null,"svorky",null,"dveře",null,"IK",null,null,null,null,null,null,null,null,"GD102 -  pro nástěnnou montáž  - Plastový -  2 modulů",null,null,null,null,null,null,"dveře","svorky"]
["Rozvaděče",null,null,null,"Vestavné rozvaděče Golf IP40",null,null,null,null,null,null,null,null,null,null,null,null,null,null,null,null,null,null,null,null,null,null,null,null,null,"GD104 -  pro nástěnnou montáž  - Plastový -  4 modulů",null,null,null,null,null,null,"Plné dveře","Šroubové PE/N svorky"]
[{"$f":"CONCATENATE(C3,\" -  pro \",K3,\" montáž  - \",J3,\" -  \",M3,\" modulů\")","v":"VF104 -  pro zapuštěnou montáž  - Plastový -  4 modulů"},{"$f":"CONCATENATE(A3,R3,T3)","v":"VF104 -  pro zapuštěnou montáž  - Plastový -  4 modulůPlné dveřeŠroubové PE/N svorky"},"VF104","VF104PD",null,5.9,null,null,63,"Plastový","zapuštěnou","189x170x72",4,40,"II","zapuštěnou golf","Zkoušeno žhavou smyčkou 850°C, vhodné pro instalaci do dutých příček","Plné dveře","P","Šroubové PE/N svorky","D","07",{"$f":"CONCATENATE(C3,\" -  pro \",K3,\" montáž  - \",J3,\" -  \",M3,\" modulů\")","v":"VF104 -  pro zapuštěnou montáž  - Plastový -  4 modulů"},null,null,null,null,null,null,null,"GD106 -  pro nástěnnou montáž  - Plastový -  6 modulů",null,null,null,null,null,null,"Transparetní dveře","Bezšroubové PE/N svorky"]
["VF108 -  pro zapuštěnou montáž  - Plastový -  8 modulů",{"$f":"CONCATENATE(A4,R4,T4)","v":"VF108 -  pro zapuštěnou montáž  - Plastový -  8 modulůPlné dveřeŠroubové PE/N svorky"},"VF108","VF108PD",null,6.2,null,null,63,"Plastový","zapuštěnou","189x242x72",8,40,"II","zapuštěnou golf","Zkoušeno žhavou smyčkou 850°C, vhodné pro instalaci do dutých příček","Plné dveře","P","Šroubové PE/N svorky","D","07","VF108 -  pro zapuštěnou montáž  - Plastový -  8 modulů",null,null,null,null,null,null,null,"GD108 -  pro nástěnnou montáž  - Plastový -  8 modulů",null,null,null,null,null,null,"Bez dveří","Bez PE/N svorek"]
["VF112 -  pro zapuštěnou montáž  - Plastový -  12 modulů","VF112 -  pro zapuštěnou montáž  - Plastový -  12 modulůPlné dveřeŠroubové PE/N svorky","VF112","VF112PD",null,9.5,null,null,63,"Plastový","zapuštěnou","257x318x72",12,40,"II","zapuštěnou golf","Zkoušeno žhavou smyčkou 850°C, vhodné pro instalaci do dutých příček","Plné dveře","P","Šroubové PE/N svorky","D","07","VF112 -  pro zapuštěnou montáž  - Plastový -  12 modulů",null,null,null,null,null,null,null,"GD110 -  pro nástěnnou montáž  - Plastový -  10 modulů"]
["VF118 -  pro zapuštěnou montáž  - Plastový -  18 modulů","VF118 -  pro zapuštěnou montáž  - Plastový -  18 modulůPlné dveřeŠroubové PE/N svorky","VF118","VF118PD",null,12.8,null,null,63,"Plastový","zapuštěnou","257x426x72",18,40,"II","zapuštěnou golf","Zkoušeno žhavou smyčkou 850°C, vhodné pro instalaci do dutých příček","Plné dveře","P","Šroubové PE/N svorky","D","07","VF118 -  pro zapuštěnou montáž  - Plastový -  18 modulů",null,null,null,null,null,null,null,"VR108  -  pro zapuštěnou montáž  - Plastový -  8 modulů"]
["VF122 -  pro zapuštěnou montáž  - Plastový -  22 modulů","VF122 -  pro zapuštěnou montáž  - Plastový -  22 modulůPlné dveřeŠroubové PE/N svorky","VF122","VF122PD",null,14.9,null,null,63,"Plastový","zapuštěnou","257x498x72",22,40,"II","zapuštěnou golf","Zkoušeno žhavou smyčkou 850°C, vhodné pro instalaci do dutých příček","Plné dveře","P","Šroubové PE/N svorky","D","07","VF122 -  pro zapuštěnou montáž  - Plastový -  22 modulů",null,null,null,null,null,null,null,"VR112  -  pro zapuštěnou montáž  - Plastový -  12 modulů"]
["VF212 -  pro zapuštěnou montáž  - Plastový -  24 modulů","VF212 -  pro zapuštěnou montáž  - Plastový -  24 modulůPlné dveřeŠroubové PE/N svorky","VF212","VF212PD",null,12.6,null,null,63,"Plastový","zapuštěnou","382x318x72",24,40,"II","zapuštěnou golf","Zkoušeno žhavou smyčkou 850°C, vhodné pro instalaci do dutých příček","Plné dveře","P","Šroubové PE/N svorky","D","07","VF212 -  pro zapuštěnou montáž  - Plastový -  24 modulů",null,null,null,null,null,null,null,"VR118  -  pro zapuštěnou montáž  - Plastový -  18 modulů"]
{"$rows_left_out":385}
{"sheet":"Ceník Hager_Polo_Tehalit","index":5,"n_rows":1498,"n_cols":19,"rows_kept":1498,"cut":false,"hidden":true,"merged":[[0,1,0,2]]}
[null,"Ceník Hager Electro s.r.o.",null,null,"produkt"]
[null,"platný od 1.6.2014"]
[]
[null,null,"Staré obj.č.","Popis","Produkt","provedení","provedení 2","proud","výsledek","Objednací číslo","modulů","tepelné ztráty 2018","vývod","chrániče","1F","více fáz","Katalogová cena  [Kč]","Měrná jednotka","Popis"]
[453,"ADA506D",null,"Proud.chr. s nadpr.ochr. char. B, 1+N, 6A / 0,03 A, typ A, 10 kA","Kombi chránič 2p, 10kA","char. B","6A",6,{"$f":"CONCATENATE(E5,F5,G5)","v":"Kombi chránič 2p, 10kAchar. B6A"},"ADA506D",2,1.9,1,1,null,1,1744,"ks","Proud.chr. s nadpr.ochr. char. B, 1+N, 6A / 0,03 A, typ A, 10 kA"]
[454,"ADA510D",null,"Proud.chr. s nadpr.ochr. char. B, 1+N, 10A / 0,03 A, typ A, 10 kA","Kombi chránič 2p, 10kA","char. B","10A",10,"Kombi chránič 2p, 10kAchar. B10A","ADA510D",2,3.4,1,1,null,1,1533,"ks","Proud.chr. s nadpr.ochr. char. B, 1+N, 10A / 0,03 A, typ A, 10 kA"]
[455,"ADA513D",null,"Proud.chr. s nadpr.ochr. char. B, 1+N, 13A / 0,03 A, typ A, 10 kA","Kombi chránič 2p, 10kA","char. B","13A",13,"Kombi chránič 2p, 10kAchar. B13A","ADA513D",2,3.8,1,1,null,1,1622,"ks","Proud.chr. s nadpr.ochr. char. B, 1+N, 13A / 0,03 A, typ A, 10 kA"]
[456,"ADA516D",null,"Proud.chr. s nadpr.ochr. char. B, 1+N, 16A / 0,03 A, typ A, 10 kA","Kombi chránič 2p, 10kA","char. B","16A",16,"Kombi chránič 2p, 10kAchar. B16A","ADA516D",2,5.2,1,1,null,1,1315,"ks","Proud.chr. s nadpr.ochr. char. B, 1+N, 16A / 0,03 A, typ A, 10 kA"]
{"$rows_left_out":1490}